{"text_format":"1","workbook":"xlsx","n_sheets":15,"sheets":["Sheet1","Budget","Jul","Aug","Sep","Oct","Nov","Dec","Jan","Feb","Mar","Apr","May","Jun","CloseOut"],"not_rendered":{"charts":0,"images":0,"macros":1,"external_links":0,"defined_names":30,"comments":0,"pivot_tables":0},"unopened":[],"bounds":{"document_bytes":16777216,"sheet_cells":100000,"rows_first":2000,"rows_last":500,"rows_between":2000,"halvings":0,"cell_chars":16384,"cell_head_chars":4096},"cells_cut":0,"cells_raw":0,"read":"whole","date_system":"1900"}

{"sheet":"Sheet1","index":0,"n_rows":15,"n_cols":22,"rows_kept":15,"cut":false,"hidden":true,"merged":[]}
[null,"Beginning Date","2011-07-01",null,null,null,null,null,null,null,null,null,null,null,null,null,null,{"$f":"+R2+N2","v":0}]
[null,null,null,null,null,null,null,null,null,null,null,null,null,{"$f":"SUM(L5:N5)","v":0},null,null,null,{"$f":"SUM(P5:R5)","v":0}]
[null,null,null,null,null,null,null,null,null,null,null,11,null,null,null,null,null,null,null,19,null,21]
[null,"Select A Name","Grant #","PO#","Program ","Telephone Reassurance",null,"Peer Counseling",null,"Federal Funds",null,"Cash Match TeleReass","In-Kind Match TeleReass","Program Income TeleReass","Cash                  Non-Match","Cash Match C2","In-Kind Match C2","Program Income C2",null,"Contact","Phone","Address"]
[1]
[2]
{"$rows_left_out":10}
{"sheet":"Budget","index":1,"n_rows":122,"n_cols":32,"rows_kept":122,"cut":false,"hidden":false,"merged":[[11,30,12,30],[11,21,12,22],[26,22,26,24],[27,22,27,24],[18,23,18,24],[18,29,18,30],[13,21,13,22],[11,26,12,29],[13,23,13,25],[13,26,13,29],[11,23,12,25],[22,22,22,24],[23,22,23,24],[24,22,24,24],[25,22,25,24],[4,12,4,19],[4,22,4,29],[5,26,5,29],[6,26,6,29],[5,15,5,16],[6,15,6,16],[7,1,8,2],[7,3,8,3],[9,1,9,2],[41,1,41,2],[35,1,35,2],[23,1,23,2],[28,11,28,12],[18,11,18,12],[43,1,43,2],[27,1,27,2],[18,1,18,2],[40,11,40,12],[41,11,41,12],[31,11,31,12],[34,11,34,12],[35,11,35,12],[43,11,43,12],[1,4,1,5],[1,14,1,15],[7,11,8,12],[40,1,40,2],[28,1,28,2],[31,1,31,2],[34,1,34,2],[5,5,5,6],[4,2,4,9],[6,5,6,6],[7,13,8,13],[7,15,7,16],[7,5,7,6],[7,7,7,8],[23,11,23,12],[27,11,27,12],[46,21,47,31],[28,29,31,30],[31,22,31,24],[33,22,33,24],[28,22,28,24],[7,17,7,18],[9,11,9,12],[5,24,5,25],[6,24,6,25],[7,24,7,25],[5,1,6,4],[5,11,6,14],[5,7,5,8],[5,17,5,18],[6,7,6,8],[6,17,6,18]]}
[null,null,null,null,null,null,null,null,null,null,null,null,null,null,null,null,null,null,null,null,null,"Title 3B - Senior Support Line"]
[null,"PROJECT BUDGET FOR JUL 1, 2015 -June 30, 2016",null,null,"Telephone Reassurance",null,null,null,null,null,null,{"$f":"+B2","v":"PROJECT BUDGET FOR JUL 1, 2015 -June 30, 2016"},null,null,"Peer Counseling",null,null,null,null,null,null,{"$f":"+L2","v":"PROJECT BUDGET FOR JUL 1, 2015 -June 30, 2016"},null,null,null,null,null,"2015-07-01",{"$f":"+AB2+365","v":"2016-06-30"}]
[]
[]
[null,"AGENCY NAME:      ","Camarillo Health Care District",null,null,null,null,null,null,null,null,"AGENCY NAME:       ",{"$f":"LEFT(C5,FIND(\" \",C5))&MID(C5,FIND(\" \",C5,1)+1,LEN(C5))","v":"Camarillo Health Care District"},{"$f":"LEFT(#REF!,FIND(\" \",#REF!))&MID(#REF!,FIND(\" \",#REF!,1)+1,LEN(#REF!))","v":{"$error":"#REF!"}},{"$f":"LEFT(#REF!,FIND(\" \",#REF!))&MID(#REF!,FIND(\" \",#REF!,1)+1,LEN(#REF!))","v":{"$error":"#REF!"}},{"$f":"LEFT(#REF!,FIND(\" \",#REF!))&MID(#REF!,FIND(\" \",#REF!,1)+1,LEN(#REF!))","v":{"$error":"#REF!"}},{"$f":"LEFT(#REF!,FIND(\" \",#REF!))&MID(#REF!,FIND(\" \",#REF!,1)+1,LEN(#REF!))","v":{"$error":"#REF!"}},{"$f":"LEFT(#REF!,FIND(\" \",#REF!))&MID(#REF!,FIND(\" \",#REF!,1)+1,LEN(#REF!))","v":{"$error":"#REF!"}},{"$f":"LEFT(#REF!,FIND(\" \",#REF!))&MID(#REF!,FIND(\" \",#REF!,1)+1,LEN(#REF!))","v":{"$error":"#REF!"}},{"$f":"LEFT(#REF!,FIND(\" \",#REF!))&MID(#REF!,FIND(\" \",#REF!,1)+1,LEN(#REF!))","v":{"$error":"#REF!"}},null,"AGENCY NAME:       ",{"$f":"LEFT(C5,FIND(\" \",C5))&MID(C5,FIND(\" \",C5,1)+1,LEN(C5))","v":"Camarillo Health Care District"},{"$f":"LEFT(#REF!,FIND(\" \",#REF!))&MID(#REF!,FIND(\" \",#REF!,1)+1,LEN(#REF!))","v":{"$error":"#REF!"}},{"$f":"LEFT(B8,FIND(\" \",B8))&MID(B8,FIND(\" \",B8,1)+1,LEN(B8))","v":"PROJECT BUDGET CATEGORIES"},{"$error":"#VALUE!"}," Total Program Costs",{"$error":"#VALUE!"},{"$error":"#VALUE!"},{"$error":"#VALUE!"}]
[null,null,null,null,null,"CONTACT NAME",null,{"$f":"+AA6","v":"Renee Murphy"},{"$f":"VLOOKUP($W$5,Sheet1!$B$5:$V$15,3,FALSE)","v":"PC 5700B130343"},null,null,null,null,null,null,"CONTACT NAME",null,{"$f":"+AA6","v":"Renee Murphy"},null,null,null," "," ",null,"CONTACT NAME",null,"Renee Murphy",{"$f":"VLOOKUP($W$5,Sheet1!$B$5:$V$15,3,FALSE)","v":"PC 5700B130343"},{"$f":"VLOOKUP($W$5,Sheet1!$B$5:$V$15,3,FALSE)","v":"PC 5700B130343"},{"$f":"VLOOKUP($W$5,Sheet1!$B$5:$V$15,3,FALSE)","v":"PC 5700B130343"}]
{"$rows_left_out":117}
{"sheet":"Jul","index":2,"n_rows":61,"n_cols":18,"rows_kept":61,"cut":false,"hidden":false,"merged":[[59,11,59,12],[58,11,58,13],[60,6,60,7],[7,0,7,1],[58,0,58,1],[8,0,8,1],[20,0,20,1],[48,0,48,1],[49,0,49,1],[50,0,50,1],[46,0,46,1],[43,0,43,1],[36,0,36,1],[29,0,29,1],[9,2,9,3],[51,0,51,17],[58,6,58,7],[58,15,58,16],[2,2,2,3],[0,1,0,3],[49,13,49,17],[50,13,50,17],[48,8,48,11],[49,8,49,11],[50,8,50,11],[2,9,2,13],[25,0,25,1],[33,0,33,1],[48,13,48,17],[47,0,47,1]]}
["Contractor Name: ",{"$f":"+Budget!C5","v":"Camarillo Health Care District"},null,null,"Month:",{"$f":"+Budget!AB2","v":"2015-07-01"},null,null,"PO#",{"$f":"+Budget!W8","v":"PC 5700B TBD"},null,null,"GRANT AWARD AMOUNT: ",null,"TeleReass: ",{"$f":"+Budget!Z38","v":0},"PeerCnsl",{"$f":"+Budget!AA38","v":0}]
["Project Name: ",{"$f":"VLOOKUP($B$1,Sheet1!$B$5:$V$17,4,FALSE)","v":"Title 3B - 93.044"},null,null,"Grant#: ",{"$f":"+Budget!V10","v":"3B-800-1516-Y1"},null,null,"Contact: ",{"$f":"VLOOKUP($B$1,Sheet1!$B$5:$V$17,19,FALSE)","v":"Renee Murphy"},null,"Phone:  ",{"$f":"VLOOKUP($B$1,Sheet1!$B$5:$V$17,20,FALSE)","v":"(805) 388-1952 x102"},null,null,"Total:",null,{"$f":"+P1+R1","v":0}]
[null,null,null,null,null,null,null,null,"Address:",{"$f":"VLOOKUP($B$1,Sheet1!$B$5:$V$17,21,FALSE)","v":"3639 Las Posas Road, Camarillo, CA93010"},{"$f":"VLOOKUP($B$1,Sheet1!$B$5:$V$17,19,FALSE)","v":"Renee Murphy"},{"$f":"VLOOKUP($B$1,Sheet1!$B$5:$V$17,19,FALSE)","v":"Renee Murphy"},{"$f":"VLOOKUP($B$1,Sheet1!$B$5:$V$17,19,FALSE)","v":"Renee Murphy"},{"$f":"VLOOKUP($B$1,Sheet1!$B$5:$V$17,19,FALSE)","v":"Renee Murphy"}]
[]
[null,null,null,null,null,null,null,null,"Current Month Expenditures by Funding Source"]
[]
{"$rows_left_out":56}
{"sheet":"Aug","index":3,"n_rows":61,"n_cols":18,"rows_kept":61,"cut":false,"hidden":false,"merged":[[60,6,60,7],[58,0,58,1],[51,0,51,17],[58,11,58,13],[8,0,8,1],[25,0,25,1],[49,0,49,1],[50,0,50,1],[48,0,48,1],[47,0,47,1],[46,0,46,1],[29,0,29,1],[20,0,20,1],[59,11,59,12],[0,1,0,3],[2,2,2,3],[2,9,2,13],[7,0,7,1],[58,15,58,16],[58,6,58,7],[33,0,33,1],[50,8,50,11],[50,13,50,17],[49,8,49,11],[43,0,43,1],[36,0,36,1],[49,13,49,17],[48,8,48,11],[48,13,48,17],[9,2,9,3]]}
["Contractor Name: ",{"$f":"+Jul!B1","v":"Camarillo Health Care District"},null,null,"Month:",{"$f":"+Jul!F1+31","v":"2015-08-01"},null,null,"PO#",{"$f":"+Jul!J1","v":"PC 5700B TBD"},null,null,"GRANT AWARD AMOUNT: ",null,"TeleReass: ",{"$f":"+Jul!P1","v":0},"PeerCnsl",{"$f":"+Jul!R1","v":0}]
["Project Name: ",{"$f":"+Budget!V1","v":"Title 3B - Senior Support Line"},null,null,"Grant#: ",{"$f":"+Jul!F2","v":"3B-800-1516-Y1"},null,null,"Contact: ",{"$f":"+Jul!J2","v":"Renee Murphy"},null,"Phone:  ",{"$f":"+Jul!M2","v":"(805) 388-1952 x102"},null,null,{"$f":"+Jul!P2","v":"Total:"},null,{"$f":"+P1+R1","v":0}]
[null,null,null,null,null,null,null,null,"Address:",{"$f":"+Jul!J3","v":"3639 Las Posas Road, Camarillo, CA93010"}]
[]
[null,null,null,null,null,null,null,null,"Current Month Expenditures by Funding Source"]
[]
{"$rows_left_out":56}
{"sheet":"Sep","index":4,"n_rows":61,"n_cols":18,"rows_kept":61,"cut":false,"hidden":false,"merged":[[2,2,2,3],[8,0,8,1],[2,9,2,13],[0,1,0,3],[60,6,60,7],[58,11,58,13],[48,8,48,11],[48,13,48,17],[49,8,49,11],[49,13,49,17],[46,0,46,1],[20,0,20,1],[58,0,58,1],[47,0,47,1],[49,0,49,1],[48,0,48,1],[59,11,59,12],[58,15,58,16],[7,0,7,1],[9,2,9,3],[33,0,33,1],[29,0,29,1],[43,0,43,1],[36,0,36,1],[50,8,50,11],[50,13,50,17],[51,0,51,17],[50,0,50,1],[25,0,25,1],[58,6,58,7]]}
[{"$f":"+Aug!A1","v":"Contractor Name: "},{"$f":"+Aug!B1","v":"Camarillo Health Care District"},null,null,"Month:",{"$f":"+Aug!F1+31","v":"2015-09-01"},null,null,"PO#",{"$f":"+Aug!J1","v":"PC 5700B TBD"},null,null,"GRANT AWARD AMOUNT: ",null,"TeleReass: ",{"$f":"+Jul!P1","v":0},"PeerCnsl",{"$f":"+Jul!R1","v":0}]
[{"$f":"+Aug!A2","v":"Project Name: "},{"$f":"+Budget!V1","v":"Title 3B - Senior Support Line"},null,null,"Grant#: ",{"$f":"+Aug!F2","v":"3B-800-1516-Y1"},null,null,"Contact: ",{"$f":"+Aug!J2","v":"Renee Murphy"},null,{"$f":"+Aug!L2","v":"Phone:  "},{"$f":"+Aug!M2","v":"(805) 388-1952 x102"},null,null,"Total C:",null,{"$f":"+P1+R1","v":0}]
[null,null,null,null,null,null,null,null,"Address:",{"$f":"+Sheet1!V15","v":0}]
[]
[null,null,null,null,null,null,null,null,"Current Month Expenditures by Funding Source"]
[]
{"$rows_left_out":56}
{"sheet":"Oct","index":5,"n_rows":61,"n_cols":18,"rows_kept":61,"cut":false,"hidden":false,"merged":[[1,5,1,6],[2,9,2,13],[0,1,0,3],[60,6,60,7],[49,0,49,1],[50,0,50,1],[48,0,48,1],[51,0,51,17],[58,11,58,13],[58,15,58,17],[58,6,58,7],[58,0,58,1],[47,0,47,1],[20,0,20,1],[50,8,50,11],[50,13,50,17],[7,0,7,1],[9,2,9,3],[46,0,46,1],[25,0,25,1],[33,0,33,1],[29,0,29,1],[43,0,43,1],[36,0,36,1],[59,11,59,12],[48,8,48,11],[48,13,48,17],[49,8,49,11],[49,13,49,17]]}
[{"$f":"+Sep!A1","v":"Contractor Name: "},{"$f":"+Sep!B1","v":"Camarillo Health Care District"},null,null,"Month:",{"$f":"+Sep!F1+31","v":"2015-10-02"},null,null,"PO#",{"$f":"+Sep!J1","v":"PC 5700B TBD"},null,null,"GRANT AWARD AMOUNT: ",null,"TeleReass: ",{"$f":"+Budget!Z38","v":0},"PeerCnsl",{"$f":"+Budget!AA38","v":0}]
[{"$f":"+Sep!A2","v":"Project Name: "},{"$f":"+Budget!V1","v":"Title 3B - Senior Support Line"},null,null,"Grant#: ",{"$f":"+Sep!F2","v":"3B-800-1516-Y1"},null,null,"Contact: ",{"$f":"+Sep!J2","v":"Renee Murphy"},null,{"$f":"+Sep!L2","v":"Phone:  "},{"$f":"+Sep!M2","v":"(805) 388-1952 x102"},null,null,"Total C:",null,{"$f":"+P1+R1","v":0}]
[null,null,null,null,null,null,null,null,"Address:",{"$f":"+Sep!J3","v":0}]
[]
[null,null,null,null,null,null,null,null,"Current Month Expenditures by Funding Source"]
[]
{"$rows_left_out":56}
{"sheet":"Nov","index":6,"n_rows":61,"n_cols":18,"rows_kept":61,"cut":false,"hidden":false,"merged":[[1,5,1,6],[2,9,2,13],[0,1,0,3],[60,6,60,7],[58,11,58,13],[48,8,48,11],[48,13,48,17],[49,8,49,11],[49,13,49,17],[46,0,46,1],[20,0,20,1],[58,0,58,1],[47,0,47,1],[49,0,49,1],[48,0,48,1],[25,0,25,1],[58,15,58,17],[58,6,58,7],[50,8,50,11],[50,13,50,17],[51,0,51,17],[50,0,50,1],[59,11,59,12],[7,0,7,1],[9,2,9,3],[33,0,33,1],[29,0,29,1],[43,0,43,1],[36,0,36,1]]}
[{"$f":"+Oct!A1","v":"Contractor Name: "},{"$f":"+Oct!B1","v":"Camarillo Health Care District"},null,null,"Month:",{"$f":"+Oct!F1+31","v":"2015-11-02"},null,null,"PO#",{"$f":"+Oct!J1","v":"PC 5700B TBD"},null,null,"GRANT AWARD AMOUNT: ",null,"TeleReass: ",{"$f":"+Oct!P1","v":0},"PeerCnsl",{"$f":"+Oct!R1","v":0}]
[{"$f":"+Oct!A2","v":"Project Name: "},{"$f":"+Budget!V1","v":"Title 3B - Senior Support Line"},null,null,"Grant#: ",{"$f":"+Oct!F2","v":"3B-800-1516-Y1"},null,null,"Contact: ",{"$f":"+Oct!J2","v":"Renee Murphy"},null,{"$f":"+Oct!L2","v":"Phone:  "},{"$f":"+Oct!M2","v":"(805) 388-1952 x102"},null,null,"Total C:",null,{"$f":"+P1+R1","v":0}]
[null,null,null,null,null,null,null,null,"Address:",{"$f":"+Oct!J3","v":0}]
[]
[null,null,null,null,null,null,null,null,"Current Month Expenditures by Funding Source"]
[]
{"$rows_left_out":56}
{"sheet":"Dec","index":7,"n_rows":61,"n_cols":18,"rows_kept":61,"cut":false,"hidden":false,"merged":[[0,1,0,3],[60,6,60,7],[58,11,58,13],[58,15,58,17],[58,6,58,7],[50,8,50,11],[50,13,50,17],[48,8,48,11],[48,13,48,17],[49,8,49,11],[49,13,49,17],[46,0,46,1],[20,0,20,1],[58,0,58,1],[43,0,43,1],[59,11,59,12],[1,5,1,7],[9,2,9,3],[25,0,25,1],[33,0,33,1],[29,0,29,1],[2,9,2,13],[36,0,36,1],[47,0,47,1],[51,0,51,17],[49,0,49,1],[50,0,50,1],[48,0,48,1],[7,0,7,1]]}
[{"$f":"+Nov!A1","v":"Contractor Name: "},{"$f":"+Nov!B1","v":"Camarillo Health Care District"},null,null,"Month:",{"$f":"+Nov!F1+30","v":"2015-12-02"},null,null,"PO#",{"$f":"+Nov!J1","v":"PC 5700B TBD"},null,null,"GRANT AWARD AMOUNT: ",null,"TeleReass: ",{"$f":"+Oct!P1","v":0},"PeerCnsl",{"$f":"+Oct!R1","v":0}]
[{"$f":"+Nov!A2","v":"Project Name: "},{"$f":"+Budget!V1","v":"Title 3B - Senior Support Line"},null,null,"Grant#: ",{"$f":"+Nov!F2","v":"3B-800-1516-Y1"},null,null,"Contact: ",{"$f":"+Nov!J2","v":"Renee Murphy"},null,{"$f":"+Nov!L2","v":"Phone:  "},{"$f":"+Nov!M2","v":"(805) 388-1952 x102"},null,null,"Total C:",null,{"$f":"+P1+R1","v":0}]
[null,null,null,null,null,null,null,null,"Address:",{"$f":"+Aug!J3","v":"3639 Las Posas Road, Camarillo, CA93010"}]
[]
[null,null,null,null,null,null,null,null,"Current Month Expenditures by Funding Source"]
[]
{"$rows_left_out":56}
{"sheet":"Jan","index":8,"n_rows":61,"n_cols":20,"rows_kept":61,"cut":false,"hidden":false,"merged":[[2,9,2,13],[0,1,0,3],[60,6,60,7],[58,11,58,13],[58,15,58,17],[58,6,58,7],[50,8,50,11],[50,13,50,17],[48,8,48,11],[48,13,48,17],[49,8,49,11],[49,13,49,17],[46,0,46,1],[20,0,20,1],[58,0,58,1],[43,0,43,1],[59,11,59,12],[7,0,7,1],[9,2,9,3],[25,0,25,1],[33,0,33,1],[29,0,29,1],[36,0,36,1],[47,0,47,1],[51,0,51,17],[49,0,49,1],[50,0,50,1],[48,0,48,1]]}
[{"$f":"+Dec!A1","v":"Contractor Name: "},{"$f":"+Dec!B1","v":"Camarillo Health Care District"},null,null,"Month:",{"$f":"+Dec!F1+31","v":"2016-01-02"},null,null,"PO#",{"$f":"+Dec!J1","v":"PC 5700B TBD"},null,null,"GRANT AWARD AMOUNT: ",null,"TeleReass: ",{"$f":"+Oct!P1","v":0},"PeerCnsl",{"$f":"+Oct!R1","v":0}]
[{"$f":"+Dec!A2","v":"Project Name: "},{"$f":"+Budget!V1","v":"Title 3B - Senior Support Line"},null,null,"Grant#: ",{"$f":"+Dec!F2","v":"3B-800-1516-Y1"},null,null,"Contact: ",{"$f":"+Dec!J2","v":"Renee Murphy"},null,{"$f":"+Dec!L2","v":"Phone:  "},{"$f":"+Dec!M2","v":"(805) 388-1952 x102"},null,null,"Total C:",null,{"$f":"+P1+R1","v":0}]
[null,null,null,null,null,null,null,null,"Address:",{"$f":"+Dec!J3","v":"3639 Las Posas Road, Camarillo, CA93010"}]
[]
[null,null,null,null,null,null,null,null,"Current Month Expenditures by Funding Source"]
[]
{"$rows_left_out":56}
{"sheet":"Feb","index":9,"n_rows":61,"n_cols":18,"rows_kept":61,"cut":false,"hidden":false,"merged":[[0,1,0,3],[60,6,60,7],[58,11,58,13],[58,15,58,17],[58,6,58,7],[50,13,50,17],[48,8,48,11],[48,13,48,17],[49,8,49,11],[49,13,49,17],[46,0,46,1],[47,0,47,1],[20,0,20,1],[50,8,50,11],[51,0,51,17],[7,0,7,1],[59,11,59,12],[9,2,9,3],[49,0,49,1],[50,0,50,1],[48,0,48,1],[25,0,25,1],[33,0,33,1],[29,0,29,1],[43,0,43,1],[36,0,36,1]]}
[{"$f":"+Jan!A1","v":"Contractor Name: "},{"$f":"+Jan!B1","v":"Camarillo Health Care District"},null,null,"Month:",{"$f":"+Jan!F1+31","v":"2016-02-02"},null,null,"PO#",{"$f":"+Jan!J1","v":"PC 5700B TBD"},null,null,"GRANT AWARD AMOUNT: ",null,"TeleReass: ",{"$f":"+Oct!P1","v":0},"PeerCnsl",{"$f":"+Oct!R1","v":0}]
[{"$f":"+Jan!A2","v":"Project Name: "},{"$f":"+Budget!V1","v":"Title 3B - Senior Support Line"},null,null,"Grant#: ",{"$f":"+Jan!F2","v":"3B-800-1516-Y1"},null,null,"Contact: ",{"$f":"+Jan!J2","v":"Renee Murphy"},null,{"$f":"+Jan!L2","v":"Phone:  "},{"$f":"+Jan!M2","v":"(805) 388-1952 x102"},null,null,"Total C:",null,{"$f":"+P1+R1","v":0}]
[null,null,null,null,null,null,null,null,"Address:",{"$f":"+Jan!J3","v":"3639 Las Posas Road, Camarillo, CA93010"}]
[]
[null,null,null,null,null,null,null,null,"Current Month Expenditures by Funding Source"]
[]
{"$rows_left_out":56}
{"sheet":"Mar","index":10,"n_rows":61,"n_cols":18,"rows_kept":61,"cut":false,"hidden":false,"merged":[[2,9,2,13],[0,1,0,3],[60,6,60,7],[58,11,58,13],[58,15,58,17],[58,6,58,7],[50,8,50,11],[50,13,50,17],[48,8,48,11],[48,13,48,17],[49,8,49,11],[49,13,49,17],[46,0,46,1],[20,0,20,1],[58,0,58,1],[43,0,43,1],[59,11,59,12],[7,0,7,1],[9,2,9,3],[25,0,25,1],[33,0,33,1],[29,0,29,1],[36,0,36,1],[47,0,47,1],[51,0,51,17],[49,0,49,1],[50,0,50,1],[48,0,48,1]]}
[{"$f":"+Feb!A1","v":"Contractor Name: "},{"$f":"+Feb!B1","v":"Camarillo Health Care District"},null,null,"Month:",{"$f":"+Feb!F1+31","v":"2016-03-04"},null,null,"PO#",{"$f":"+Feb!J1","v":"PC 5700B TBD"},null,null,"GRANT AWARD AMOUNT: ",null,"TeleReass: ",{"$f":"+Oct!P1","v":0},"PeerCnsl",{"$f":"+Oct!R1","v":0}]
[{"$f":"+Feb!A2","v":"Project Name: "},{"$f":"+Budget!V1","v":"Title 3B - Senior Support Line"},null,null,"Grant#: ",{"$f":"+Feb!F2","v":"3B-800-1516-Y1"},null,null,"Contact: ",{"$f":"+Feb!J2","v":"Renee Murphy"},null,{"$f":"+Feb!L2","v":"Phone:  "},{"$f":"+Feb!M2","v":"(805) 388-1952 x102"},null,null,"Total C:",null,{"$f":"+P1+R1","v":0}]
[null,null,null,null,null,null,null,null,"Address:",{"$f":"+Feb!J3","v":"3639 Las Posas Road, Camarillo, CA93010"}]
[]
[null,null,null,null,null,null,null,null,"Current Month Expenditures by Funding Source"]
[]
{"$rows_left_out":56}
{"sheet":"Apr","index":11,"n_rows":61,"n_cols":18,"rows_kept":61,"cut":false,"hidden":false,"merged":[[2,9,2,13],[0,1,0,3],[60,6,60,7],[58,11,58,13],[58,15,58,17],[58,6,58,7],[50,8,50,11],[50,13,50,17],[48,8,48,11],[48,13,48,17],[49,8,49,11],[49,13,49,17],[46,0,46,1],[20,0,20,1],[58,0,58,1],[43,0,43,1],[59,11,59,12],[7,0,7,1],[9,2,9,3],[25,0,25,1],[33,0,33,1],[29,0,29,1],[36,0,36,1],[47,0,47,1],[51,0,51,17],[49,0,49,1],[50,0,50,1],[48,0,48,1]]}
[{"$f":"+Mar!A1","v":"Contractor Name: "},{"$f":"+Mar!B1","v":"Camarillo Health Care District"},null,null,"Month:",{"$f":"+Mar!F1+30","v":"2016-04-03"},null,null,"PO#",{"$f":"+Mar!J1","v":"PC 5700B TBD"},null,null,"GRANT AWARD AMOUNT: ",null,"TeleReass: ",{"$f":"+Oct!P1","v":0},"PeerCnsl",{"$f":"+Oct!R1","v":0}]
[{"$f":"+Mar!A2","v":"Project Name: "},{"$f":"+Budget!V1","v":"Title 3B - Senior Support Line"},null,null,"Grant#: ",{"$f":"+Mar!F2","v":"3B-800-1516-Y1"},null,null,"Contact: ",{"$f":"+Mar!J2","v":"Renee Murphy"},null,{"$f":"+Mar!L2","v":"Phone:  "},{"$f":"+Mar!M2","v":"(805) 388-1952 x102"},null,null,"Total C:",null,{"$f":"+P1+R1","v":0}]
[null,null,null,null,null,null,null,null,"Address:",{"$f":"+Mar!J3","v":"3639 Las Posas Road, Camarillo, CA93010"}]
[]
[null,null,null,null,null,null,null,null,"Current Month Expenditures by Funding Source"]
[]
{"$rows_left_out":56}
{"sheet":"May","index":12,"n_rows":61,"n_cols":18,"rows_kept":61,"cut":false,"hidden":false,"merged":[[2,9,2,13],[0,1,0,3],[60,6,60,7],[58,11,58,13],[58,15,58,17],[58,6,58,7],[50,8,50,11],[50,13,50,17],[48,8,48,11],[48,13,48,17],[49,8,49,11],[49,13,49,17],[46,0,46,1],[20,0,20,1],[58,0,58,1],[43,0,43,1],[59,11,59,12],[7,0,7,1],[9,2,9,3],[25,0,25,1],[33,0,33,1],[29,0,29,1],[36,0,36,1],[47,0,47,1],[51,0,51,17],[49,0,49,1],[50,0,50,1],[48,0,48,1]]}
[{"$f":"+Apr!A1","v":"Contractor Name: "},{"$f":"+Apr!B1","v":"Camarillo Health Care District"},null,null,"Month:",{"$f":"+Apr!F1+31","v":"2016-05-04"},null,null,"PO#",{"$f":"+Apr!J1","v":"PC 5700B TBD"},null,null,"GRANT AWARD AMOUNT: ",null,"TeleReass: ",{"$f":"+Oct!P1","v":0},"PeerCnsl",{"$f":"+Oct!R1","v":0}]
[{"$f":"+Apr!A2","v":"Project Name: "},{"$f":"+Budget!V1","v":"Title 3B - Senior Support Line"},null,null,"Grant#: ",{"$f":"+Apr!F2","v":"3B-800-1516-Y1"},null,null,"Contact: ",{"$f":"+Apr!J2","v":"Renee Murphy"},null,{"$f":"+Apr!L2","v":"Phone:  "},{"$f":"+Apr!M2","v":"(805) 388-1952 x102"},null,null,"Total C:",null,{"$f":"+P1+R1","v":0}]
[null,null,null,null,null,null,null,null,"Address:",{"$f":"+Apr!J3","v":"3639 Las Posas Road, Camarillo, CA93010"}]
[]
[null,null,null,null,null,null,null,null,"Current Month Expenditures by Funding Source"]
[]
{"$rows_left_out":56}
{"sheet":"Jun","index":13,"n_rows":61,"n_cols":18,"rows_kept":61,"cut":false,"hidden":false,"merged":[[2,9,2,13],[0,1,0,3],[60,6,60,7],[58,11,58,13],[58,15,58,17],[58,6,58,7],[50,8,50,11],[50,13,50,17],[48,8,48,11],[48,13,48,17],[49,8,49,11],[49,13,49,17],[46,0,46,1],[20,0,20,1],[58,0,58,1],[43,0,43,1],[59,11,59,12],[7,0,7,1],[9,2,9,3],[25,0,25,1],[33,0,33,1],[29,0,29,1],[36,0,36,1],[47,0,47,1],[51,0,51,17],[49,0,49,1],[50,0,50,1],[48,0,48,1]]}
[{"$f":"+May!A1","v":"Contractor Name: "},{"$f":"+May!B1","v":"Camarillo Health Care District"},null,null,"Month:",{"$f":"+May!F1+30","v":"2016-06-03"},null,null,"PO#",{"$f":"+May!J1","v":"PC 5700B TBD"},null,null,"GRANT AWARD AMOUNT: ",null,"TeleReass: ",{"$f":"+Oct!P1","v":0},"PeerCnsl",{"$f":"+Oct!R1","v":0}]
[{"$f":"+May!A2","v":"Project Name: "},{"$f":"+Budget!V1","v":"Title 3B - Senior Support Line"},null,null,"Grant#: ",{"$f":"+May!F2","v":"3B-800-1516-Y1"},null,null,"Contact: ",{"$f":"+May!J2","v":"Renee Murphy"},null,{"$f":"+May!L2","v":"Phone:  "},{"$f":"+May!M2","v":"(805) 388-1952 x102"},null,null,"Total C:",null,{"$f":"+P1+R1","v":0}]
[null,null,null,null,null,null,null,null,"Address:",{"$f":"+May!J3","v":"3639 Las Posas Road, Camarillo, CA93010"}]
[]
[null,null,null,null,null,null,null,null,"Current Month Expenditures by Funding Source"]
[]
{"$rows_left_out":56}
{"sheet":"CloseOut","index":14,"n_rows":65,"n_cols":18,"rows_kept":65,"cut":false,"hidden":false,"merged":[[64,6,64,7],[8,12,8,14],[2,9,2,12],[62,6,62,7],[63,6,63,7],[3,12,3,14],[4,12,4,14],[5,12,5,14],[6,12,6,14],[7,12,7,14],[57,0,57,17],[62,0,62,1],[62,11,62,13],[62,15,62,17],[55,0,55,1],[55,8,55,11],[56,0,56,1],[56,8,56,11],[56,13,56,17],[42,0,42,1],[14,0,14,1],[35,0,35,1],[39,0,39,1],[31,0,31,1],[26,0,26,1],[54,0,54,1],[54,8,54,11],[54,13,54,17],[49,0,49,1],[50,0,50,1],[52,0,52,1],[53,0,53,1],[55,13,55,17],[10,12,10,13],[16,2,16,3],[16,0,16,1],[9,12,9,14]]}
[{"$f":"+May!A1","v":"Contractor Name: "},{"$f":"+May!B1","v":"Camarillo Health Care District"},null,null,"Month:",{"$f":"+May!F1+30","v":"2016-06-03"},null,null,"PO#",{"$f":"+Jun!J1","v":"PC 5700B TBD"},null,null,"GRANT AWARD AMOUNT: ",null,"TeleReass: ",{"$f":"+Jul!P1","v":0},"PeerCnsl",{"$f":"+Jul!R1","v":0}]
[{"$f":"+May!A2","v":"Project Name: "},{"$f":"+Jun!B2","v":"Title 3B - Senior Support Line"},null,null,"Grant#: ",{"$f":"+May!F2","v":"3B-800-1516-Y1"},null,null,"Contact: ",{"$f":"+Jun!J2","v":"Renee Murphy"},null,{"$f":"+May!L2","v":"Phone:  "},{"$f":"+Jun!M2","v":"(805) 388-1952 x102"},null,"Total Award:",null,null,{"$f":"+P1+R1","v":0}]
[null,null,null,null,null,null,null,null,{"$f":"+Jun!I3","v":"Address:"},{"$f":"+Jun!J3","v":"3639 Las Posas Road, Camarillo, CA93010"},null,null,null,null,{"$f":"+Budget!X9","v":"Year 1 of 4"}]
[null,null,null,null,null,null,null,null,null,null,null,null,"TOTAL PROJECT COST",null,null,null,{"$f":"+E15+F15","v":0}]
[null,null,null,null,null,null,null,null,null,null,null,null,"LESS: NON-MATCH",null,null,null,{"$f":"+Q17+R17","v":0}]
[null,null,null,null,null,null,null,null,null,null,null,null,"COSTS TO BE MATCHED",null,null,null,{"$f":"+Q4-Q5","v":0}]
{"$rows_left_out":59}